Installation of parallels 2.2.2222 with kernel 2.6.27 (openSUSE 11.1) fails

hokaff

Bit poster
I tried Installation of Parallels-2.2.2222-lin.i386.rpm on my System: kernel 2.6.27.7-9-pae (openSUSE 11.1). When running parallels-config I got the following message:
Can not compile and/or link drivers. Read /usr/lib/parallels/doc/INSTALL and follow instructions specified in this document.
But the directory /parallels/doc is not on my system. In /usr/lib/parallels/comp.log.9191.error I found the error-messages:
In file included from /usr/lib/parallels/drivers/drv_main/vmmain.c:29:
/usr/lib/parallels/drivers/drv_main/vmmain.h:193: error: field ‘pmmAccSem’ has incomplete type
/usr/lib/parallels/drivers/drv_main/vmmain.h:206: error: field ‘wsSem’ has incomplete type
In file included from /usr/lib/parallels/drivers/drv_main/vmmain.h:228,
from /usr/lib/parallels/drivers/drv_main/vmmain.c:29:
/usr/lib/parallels/drivers/drv_main/mm/mm.h:25:27: error: asm/semaphore.h: Datei oder Verzeichnis nicht g
efunden
In file included from /usr/lib/parallels/drivers/drv_main/vmmain.h:228,
from /usr/lib/parallels/drivers/drv_main/vmmain.c:29:
/usr/lib/parallels/drivers/drv_main/mm/mm.h:99: error: field ‘accSem’ has incomplete type
/usr/lib/parallels/drivers/drv_main/mm/mm.h: In function ‘vmWsetSetup’:
/usr/lib/parallels/drivers/drv_main/mm/mm.h:207: error: implicit declaration of function ‘sema_init’
make[6]: *** [/usr/lib/parallels/drivers/drv_main/vmmain.o] Fehler 1
make[5]: *** [_module_/usr/lib/parallels/drivers/drv_main] Fehler 2
make[4]: *** [sub-make] Fehler 2
make[3]: *** [all] Fehler 2
make[3]: Leaving directory `/usr/src/linux-2.6.27.7-9-obj/i386/pae'
make[2]: *** [all] Fehler 2
make[2]: Leaving directory `/usr/lib/parallels/drivers/drv_main'
make[1]: *** [vmmain] Fehler 2
make[1]: Leaving directory `/usr/lib/parallels/drivers'
make: *** [build] Fehler 2
You find the complete file attached.
Can you help me?
 

Attachments

Back
Top